Mojave install php 7.2


(Mostafa Ispareh) #1
Last 15 lines from /Users/mosi/Library/Logs/Homebrew/php/01.configure:
checking for string.h... (cached) yes
checking for strings.h... (cached) yes
checking for unistd.h... (cached) yes
checking io.h usability... no
checking io.h presence... no
checking for io.h... no
checking for strtoll... yes
checking for atoll... yes
checking for strftime... (cached) yes
checking for gettimeofday... (cached) yes
checking whether to enable LIBXML support... yes
checking libxml2 install dir... no
checking for xml2-config path... /usr/bin/xml2-config
checking whether libxml build works... no
configure: error: build test failed.  Please check the config.log for details.

Do not report this issue to Homebrew/brew or Homebrew/core!

just show this error and exit :frowning:


(Sean Molenaar) #2

Mojave is beta software, it’s bound to break at some point. We’ll try and fix this if it’s still present in the final release.


(Mostafa Ispareh) #3

This issue fixed by some hard googling and …

now the issue is in make :expressionless:
ld: file not found: /usr/lib/system/libsystem_containermanager.dylib for architecture x86_64
clang: error: linker command failed with exit code 1 (use -v to see invocation)
make: *** [ext/opcache/opcache.la] Error 1
make: *** Waiting for unfinished jobs…

any idea?


(Sean Molenaar) #4

See if the file exist, most of these issues just seem like errors in Apple their beta for Mojave.